{"text_format":"1","workbook":"xlsx","n_sheets":3,"sheets":["Fee Estimate Tool","Info","Fees"],"not_rendered":{"charts":0,"images":1,"macros":1,"external_links":0,"defined_names":4,"comments":3,"pivot_tables":0},"unopened":[],"bounds":{"document_bytes":16777216,"sheet_cells":100000,"rows_first":2000,"rows_last":500,"rows_between":2000,"halvings":0,"cell_chars":16384,"cell_head_chars":4096},"cells_cut":0,"cells_raw":0,"read":"whole","date_system":"1900"}

{"sheet":"Fee Estimate Tool","index":0,"n_rows":264,"n_cols":10,"rows_kept":264,"cut":false,"hidden":false,"merged":[[78,1,78,9],[155,1,155,9],[179,1,179,9],[67,1,68,1],[66,1,66,9],[177,1,177,9],[178,1,178,9],[156,1,157,1],[11,2,11,3],[22,2,22,5],[8,2,8,9],[62,6,62,7],[34,2,34,5],[60,2,60,9],[9,2,9,9],[15,2,15,5],[16,2,16,5],[14,2,14,5],[30,1,30,5],[40,1,40,2],[41,1,41,2],[24,2,24,5],[35,2,35,5],[2,1,2,9],[1,1,1,9],[3,1,3,9],[4,1,4,9],[6,1,6,9],[205,2,205,5],[206,2,206,5],[7,1,7,9],[38,2,38,3],[61,6,61,7],[63,6,63,7],[59,1,59,9],[10,2,10,3],[23,2,23,5],[19,2,19,5],[20,2,20,5],[21,2,21,5],[17,2,17,5],[13,2,13,3],[163,1,164,1],[77,1,77,9],[212,1,212,5],[63,2,64,5],[219,2,219,6],[12,2,12,3],[37,2,37,5],[214,1,214,5],[215,1,215,5],[209,1,209,6],[25,2,25,5],[31,2,31,5],[32,2,32,5],[33,2,33,5],[36,2,36,5],[180,1,180,9],[79,1,80,1],[72,1,73,1],[241,6,241,7],[240,3,240,7],[210,1,210,6],[111,1,112,1],[216,1,216,6],[210,7,210,9],[218,1,218,6],[218,7,218,9],[207,1,207,9],[208,1,208,9],[194,1,194,9],[193,1,193,9],[216,7,216,9],[213,1,213,5],[209,7,209,9],[211,1,211,5]]}
[]
[null,"Personal Information is collected under the authority of Section 11 of the Municipal Act, 2001, c.25. The information will be used for the administration of event performance(s) at Meadowvale Theatre and to contact you regarding your event/performance(s).  Questions about this collection should be directed to Manager, Meadowvale Theatre, City of Mississauga 905-615-3200 ext. 5356"]
[null,"This fee schedule is a planning tool for clients to estimate Meadowvale Theatre costs. Final reconciled costs will be sent to the signing authority following the event."]
[null,"Save form to desktop and complete on computer."]
[null,"Enter event details in the grey cells below for a cost estimate. If cells becomes pink, there is mandatory requirement."]
[null,null,null,"Example",null,null,"Example"]
[null,"Click here, Community Groups and Affiliates have applied and been approved for formal recognition through the City's Community Group Support Program"]
[null,"C O N T R A C T    I N F O R M A T I O N"]
[null,"Organization Name, if applicable"]
[null,"Street Address"]
[null,"City"]
[null,"Postal Code"]
[null,"Province"]
[null,"Phone Number"]
[null,"Organizer Status"]
[null,"NFP ID Number"]
[null,"Business Number"]
[null,"HST Number"]
[]
[null,"Signing Authority Name"]
{"$rows_left_out":245}
{"sheet":"Info","index":1,"n_rows":120,"n_cols":53,"rows_kept":120,"cut":false,"hidden":true,"merged":[]}
[null,"Theatre Auditorium","Lobby","Rehearsal Hall","Green Room",null,"DAILY TERMS - >",{"$f":"Fees!A14","v":"Fog Machine"},{"$f":"Fees!A15","v":"Hazer"},{"$f":"Fees!A16","v":"Wireless Microphones"},{"$f":"Fees!#REF!","v":{"$error":"#REF!"}},{"$f":"Fees!A17","v":"Intelligent Lighting Package"},{"$f":"Fees!A18","v":"Wireless Communication Pack"},null,null,"WEEKLY TERMS - >",{"$f":"H1","v":"Fog Machine"},"Hazer","Wireless Microphones",{"$error":"#REF!"},"Intelligent Lighting Package","Wireless Communication Pack",{"$f":"Fees!A43","v":"Meal Charges (per person, per infringement)"},{"$f":"Fees!A44","v":"HST"},{"$f":"Fees!A34","v":"Late Use Charge per hour (tax)"},{"$f":"Fees!A45","v":"Late Payment Interest"},{"$f":"Fees!A46","v":"Non-Sufficient Funds (NSF) Charge"},null,null,{"$f":"Fees!A29","v":"Technical Supervisor"},{"$f":"Fees!A31","v":"Technician"},{"$f":"Fees!A30","v":"Front of House Coordinator"},{"$f":"Fees!A32","v":"Front of House Usher"},{"$f":"Fees!A41","v":"Ticket Printing"},null,null,{"$f":"Fees!A36","v":"Community Access Fund Fee"},{"$f":"Fees!A35","v":"Box Office Commission"},{"$f":"Fees!A26","v":"Glow Tape (per foot)"},{"$f":"Fees!A27","v":"Gaff Tape"},{"$f":"Fees!A37","v":"Piano"},null,{"$f":"Fees!A48","v":"Insurance Purchased through the City, includes taxes at 8%"},null,"TIME Drop Down","Lobby Access Time","Number of Intermissions","Intermission Lengths","Number of Shows","Earlies and Latest Time",null,"IMPORTANT NOTES"]
[null,null,null,null,null,null,null,null,null,null,null,null,null,null,null,null,null,null,null,null,null,null,null,null,null,null,null,null,null,null,null,null,null,null,null,null,null,null,null,null,null,null,null,null,null,null,null,null,null,null,null,"Do not edit or touch the cells in black, you will break the formulas","example"]
[{"$f":"Fees!B7","v":"Registered Not-for-Profit / Community Group"},{"$f":"Fees!B8","v":314},{"$f":"Fees!B10","v":320},{"$f":"Fees!B9","v":122},{"$f":"Fees!B11","v":0},null,null,{"$f":"Fees!B14","v":25},{"$f":"Fees!B15","v":25},{"$f":"Fees!B16","v":35},{"$f":"Fees!#REF!","v":{"$error":"#REF!"}},{"$f":"Fees!B17","v":300},{"$f":"Fees!B18","v":35},null,null,null,{"$f":"Fees!B20","v":75},{"$f":"Fees!B21","v":75},{"$f":"Fees!B22","v":100},{"$f":"Fees!#REF!","v":{"$error":"#REF!"}},{"$f":"Fees!B23","v":300},{"$f":"Fees!B24","v":100},{"$f":"Fees!B43","v":20},{"$f":"Fees!B44","v":0.13},{"$f":"Fees!B34","v":140},{"$f":"Fees!B45","v":1.2500000000000001E-2},{"$f":"Fees!B46","v":40},null,null,{"$f":"Fees!B29","v":48.5},{"$f":"Fees!B31","v":26},{"$f":"Fees!B30","v":48.5},{"$f":"Fees!B32","v":19.5},{"$f":"Fees!B41","v":0.2},null,null,{"$f":"Fees!B36","v":1.5},{"$f":"Fees!B35","v":7.0000000000000007E-2},{"$f":"Fees!B26","v":1.5},{"$f":"Fees!B27","v":40},{"$f":"Fees!B37","v":200},null,{"$f":"Fees!B48","v":42.32},null,null,"00:00:00",0,"00:00:00",1,"07:00:00",null,"Some of these cells are the drop-downs selections and are used in various formulas."]
[{"$f":"Fees!C7","v":"Private"},{"$f":"Fees!C8","v":418},{"$f":"Fees!C10","v":400},{"$f":"Fees!C9","v":155},{"$f":"Fees!C11","v":0},null,null,{"$f":"Fees!C14","v":25},{"$f":"Fees!C15","v":25},{"$f":"Fees!C16","v":35},{"$f":"Fees!#REF!","v":{"$error":"#REF!"}},{"$f":"Fees!C17","v":300},{"$f":"Fees!C18","v":35},null,null,null,{"$f":"Fees!C20","v":75},{"$f":"Fees!C21","v":75},{"$f":"Fees!C22","v":100},{"$f":"Fees!#REF!","v":{"$error":"#REF!"}},{"$f":"Fees!C23","v":300},{"$f":"Fees!C24","v":100},null,null,null,null,null,null,"Minimum Hours ->",{"$f":"Fees!D29","v":4},{"$f":"Fees!D31","v":4},{"$f":"Fees!D30","v":3},{"$f":"Fees!D32","v":3},null,null,null,null,null,null,null,null,null,{"$f":"Fees!C48","v":126.97},null,"05:00:00","00:30:00",1,"00:15:00",2,1.0833333333333299,null,"NOTES FOR Information Tech Team"]
[{"$f":"Fees!D7","v":"Affiliate"},{"$f":"Fees!D8","v":235},{"$f":"Fees!D10","v":183},{"$f":"Fees!D9","v":99},{"$f":"Fees!D11","v":0},null,null,{"$f":"Fees!D14","v":15},{"$f":"Fees!D15","v":15},{"$f":"Fees!D16","v":17.5},{"$f":"Fees!#REF!","v":{"$error":"#REF!"}},{"$f":"Fees!D17","v":300},{"$f":"Fees!D18","v":17.5},null,null,null,{"$f":"Fees!D20","v":60},{"$f":"Fees!D21","v":60},{"$f":"Fees!D22","v":62.5},{"$f":"Fees!#REF!","v":{"$error":"#REF!"}},{"$f":"Fees!D23","v":300},{"$f":"Fees!D24","v":62.5},null,null,null,null,null,null,null,null,null,null,null,null,null,null,{"$f":"(AK3*X3)+AK3","v":1.6950000000000001},null,null,null,null,null,null,null,"05:30:00","01:00:00",2,"00:20:00",3,null,null,"Comments for grey cells and black cells explain that cells logic and/or purpose"]
[{"$f":"Fees!E7","v":"Commercial"},{"$f":"Fees!E8","v":627},{"$f":"Fees!E10","v":520},{"$f":"Fees!E9","v":200},{"$f":"Fees!E11","v":0},null,null,{"$f":"Fees!E14","v":25},{"$f":"Fees!E15","v":25},{"$f":"Fees!E16","v":35},{"$f":"Fees!#REF!","v":{"$error":"#REF!"}},{"$f":"Fees!E17","v":300},{"$f":"Fees!E18","v":35},null,null,null,{"$f":"Fees!E20","v":75},{"$f":"Fees!E21","v":75},{"$f":"Fees!E22","v":100},{"$f":"Fees!#REF!","v":{"$error":"#REF!"}},{"$f":"Fees!E23","v":300},{"$f":"Fees!E24","v":100},null,null,{"$f":"TEXT(Y3,\"$0.00\")","v":"$140.00"},{"$f":"TEXT(Z3,\"0.00%\")","v":"1.25%"},{"$f":"TEXT(AA3,\"$0.00\")","v":"$40.00"},null,null,null,null,null,null,{"$f":"IF('Fee Estimate Tool'!C62=\"No\",AH3*'Fee Estimate Tool'!I62,0)","v":0},null,null,{"$f":"AK3*'Fee Estimate Tool'!I62","v":0},{"$f":"AL3*100","v":7.0000000000000009},{"$f":"TEXT(AM3,\"$0.00\")","v":"$1.50"},{"$f":"TEXT(AN3,\"$0.00\")","v":"$40.00"},null,null,null,null,"06:00:00","01:30:00",3,"00:30:00",4,"05:00:00"]
[null,null,null,null,null,null,null,null,null,null,null,null,null,null,null,null,null,null,null,null,null,null,null,"TOTAL HOURS",{"$f":"TEXT(SUM(Y43:AA43)+'Fee Estimate Tool'!I213,\"0.0\")","v":"0.0"},null,null,null,"TOTAL HOURS",{"$f":"ROUND(AD44,1)","v":0},{"$f":"ROUND(AE44,1)","v":0},{"$f":"ROUND(AF44+AF82+AF120,1)","v":0},{"$f":"ROUND(AG44+AH44,1)","v":0},null,null,null,null,null,null,null,null,null,null,null,"06:30:00","02:00:00",4,null,null,1.000011574074074]
[null,"Booked",null,null,null,null,null,null,null,null,null,null,null,null,null,null,null,null,null,null,null,null,null,"TOTAL COST inc Tax",{"$f":"(SUM(Y44:AA44)+(Y3*'Fee Estimate Tool'!I213))*(1+X3)","v":0},null,null,null,"TOTAL COST",{"$f":"AD7*AD3","v":0},{"$f":"AE7*AE3","v":0},{"$f":"AF7*AF3","v":0},{"$f":"AG7*AG3","v":0},null,null,null,null,null,null,null,null,null,null,null,"07:00:00","02:30:00"]
[null,null,null,null,null,null,null,null,null,null,null,null,null,null,null,null,null,null,null,null,null,null,null,null,null,null,null,null,null,null,null,null,null,null,null,null,null,null,null,null,null,null,null,null,"07:30:00","03:00:00"]
[null,null,null,null,null,null,null,null,null,null,null,null,null,null,null,null,null,null,null,null,null,null,null,null,{"$f":"B1","v":"Theatre Auditorium"},{"$f":"C1","v":"Lobby"},{"$f":"D1","v":"Rehearsal Hall"},null,{"$f":"CONCATENATE(B1,\" Staffing\")","v":"Theatre Auditorium Staffing"},null,null,null,null,{"$f":"'Fee Estimate Tool'!B109","v":"Front Door Usher"},null,null,null,null,null,null,null,null,null,null,"08:00:00"]
[null,null,null,null,null,null,null,null,null,null,null,null,null,null,null,null,null,null,null,null,null,null,null,"Day 1",{"$f":"IFERROR(IF('Fee Estimate Tool'!C$82=\"\",0,IF('Fee Estimate Tool'!C$82<Info!$AX$3,(Info!$AX$3-'Fee Estimate Tool'!C$82)*24,0)),0)","v":0},{"$f":"IFERROR(IF('Fee Estimate Tool'!C$160=\"\",0,IF('Fee Estimate Tool'!C$160<Info!$AX$3,(Info!$AX$3-'Fee Estimate Tool'!C$160)*24,0)),0)","v":0},{"$f":"IFERROR(IF('Fee Estimate Tool'!C$70=\"\",0,IF('Fee Estimate Tool'!C$70<Info!$AX$3,(Info!$AX$3-'Fee Estimate Tool'!C$70)*24,0)),0)","v":0},null,"Day 1 - Staff #",{"$f":"IFERROR(SUM('Fee Estimate Tool'!C103),0)","v":0},{"$f":"IFERROR('Fee Estimate Tool'!C$104-'Fee Estimate Tool'!C$103,0)","v":0},{"$f":"IF(AND('Fee Estimate Tool'!C$93=\"Yes\",AD11=1),1,0)","v":0},{"$f":"IF('Fee Estimate Tool'!C$93=\"Yes\",'Fee Estimate Tool'!C$110-'Fee Estimate Tool'!C$109,0)","v":0},{"$f":"IF('Fee Estimate Tool'!C$93=\"Yes\",'Fee Estimate Tool'!C$109,0)","v":0},null,null,null,null,null,null,null,null,null,null,"08:30:00"]
["Day 1 - Frequency",{"$f":"IF('Fee Estimate Tool'!C94=$B$8,1,0)","v":0},{"$f":"IF('Fee Estimate Tool'!C$162=$B$8,1,0)","v":0},{"$f":"IF('Fee Estimate Tool'!C$72=$B$8,1,0)","v":0},null,null,null,null,null,null,null,null,null,null,null,null,null,null,null,null,null,null,null,"Charge",{"$f":"IFERROR(Y11*$Y$3,0)","v":0},{"$f":"IFERROR(Z11*$Y$3,0)","v":0},{"$f":"IFERROR(AA11*$Y$3,0)","v":0},null,"Hours",{"$f":"IF(COUNTA('Fee Estimate Tool'!C$82,'Fee Estimate Tool'!C$88)<=1,0,IF((('Fee Estimate Tool'!C$88-'Fee Estimate Tool'!C$82)*24)<=$AD$4,$AD$4,('Fee Estimate Tool'!C$88-'Fee Estimate Tool'!C$82)*24))","v":0},{"$f":"IF(COUNTA('Fee Estimate Tool'!C$82,'Fee Estimate Tool'!C$88)<=1,0,IF((('Fee Estimate Tool'!C$88-'Fee Estimate Tool'!C$82)*24)<=AE4,AE4,('Fee Estimate Tool'!C$88-'Fee Estimate Tool'!C$82)*24))","v":0},{"$f":"IF(COUNTA('Fee Estimate Tool'!C$85,'Fee Estimate Tool'!C$88)<=1,0,IF((('Fee Estimate Tool'!C$88-'Fee Estimate Tool'!C$84)*24)<=AF4,AF4,('Fee Estimate Tool'!C$88-'Fee Estimate Tool'!C$84)*24))","v":0},{"$f":"IF(AG11<=0,0,IF(('Fee Estimate Tool'!C$88-'Fee Estimate Tool'!C$86)*24+0.5<=$AG$4,$AG$4,('Fee Estimate Tool'!C$88-'Fee Estimate Tool'!C$86)*24+0.5))","v":0},{"$f":"IF(AH11<=0,0,IF(('Fee Estimate Tool'!C$87-'Fee Estimate Tool'!C$85)*24<=$AG$4,$AG$4,('Fee Estimate Tool'!C$87-'Fee Estimate Tool'!C$85)*24))","v":0},null,null,null,null,null,null,null,null,null,null,"09:00:00"]
["Charge",{"$f":"INDEX($B$3:$E$6,MATCH('Fee Estimate Tool'!$C$15,$A$3:$A$6,0),MATCH($B$1,$B$1:$E$1,0))*B12","v":{"$error":"#N/A"}},{"$f":"INDEX($B$3:$E$6,MATCH('Fee Estimate Tool'!$C$15,$A$3:$A$6,0),MATCH($C$1,$B$1:$E$1,0))*C12","v":{"$error":"#N/A"}},{"$f":"INDEX($B$3:$E$6,MATCH('Fee Estimate Tool'!$C$15,$A$3:$A$6,0),MATCH($D$1,$B$1:$E$1,0))*D12","v":{"$error":"#N/A"}},null,null,null,null,null,null,null,null,null,null,null,null,null,null,null,null,null,null,null,"Day 2",{"$f":"IFERROR(IF('Fee Estimate Tool'!D$82=\"\",0,IF('Fee Estimate Tool'!D$82<Info!$AX$3,(Info!$AX$3-'Fee Estimate Tool'!D$82)*24,0)),0)","v":0},{"$f":"IFERROR(IF('Fee Estimate Tool'!D$160=\"\",0,IF('Fee Estimate Tool'!D$160<Info!$AX$3,(Info!$AX$3-'Fee Estimate Tool'!D$160)*24,0)),0)","v":0},{"$f":"IFERROR(IF('Fee Estimate Tool'!D$70=\"\",0,IF('Fee Estimate Tool'!D$70<Info!$AX$3,(Info!$AX$3-'Fee Estimate Tool'!D$70)*24,0)),0)","v":0},null,"Day 2 - Staff #",{"$f":"IFERROR(SUM('Fee Estimate Tool'!D$103),0)","v":0},{"$f":"IFERROR('Fee Estimate Tool'!D$104-'Fee Estimate Tool'!D$103,0)","v":0},{"$f":"IF(AND('Fee Estimate Tool'!D$93=\"Yes\",AD13=1),1,0)","v":0},{"$f":"IF('Fee Estimate Tool'!D$93=\"Yes\",'Fee Estimate Tool'!D$110-'Fee Estimate Tool'!D$109,0)","v":0},{"$f":"IF('Fee Estimate Tool'!D$93=\"Yes\",'Fee Estimate Tool'!D$109,0)","v":0},null,null,null,null,null,null,null,null,null,null,"09:30:00"]
["Day 2 - Frequency",{"$f":"IF('Fee Estimate Tool'!D94=$B$8,1,0)","v":0},{"$f":"IF('Fee Estimate Tool'!D$162=$B$8,1,0)","v":0},{"$f":"IF('Fee Estimate Tool'!D$72=$B$8,1,0)","v":0},null,null,null,null,null,null,null,null,null,null,null,null,null,null,null,null,null,null,null,"Charge",{"$f":"IFERROR(Y13*$Y$3,0)","v":0},{"$f":"IFERROR(Z13*$Y$3,0)","v":0},{"$f":"IFERROR(AA13*$Y$3,0)","v":0},null,"Hours",{"$f":"IF(COUNTA('Fee Estimate Tool'!D$82,'Fee Estimate Tool'!D$88)<=1,0,IF((('Fee Estimate Tool'!D$88-'Fee Estimate Tool'!D$82)*24)<=$AD$4,$AD$4,('Fee Estimate Tool'!D$88-'Fee Estimate Tool'!D$82)*24))","v":0},{"$f":"IF(COUNTA('Fee Estimate Tool'!D$82,'Fee Estimate Tool'!D$88)<=1,0,IF((('Fee Estimate Tool'!D$88-'Fee Estimate Tool'!D$82)*24)<=AE4,AE4,('Fee Estimate Tool'!D$88-'Fee Estimate Tool'!D$82)*24))","v":0},{"$f":"IF(COUNTA('Fee Estimate Tool'!D$85,'Fee Estimate Tool'!D$88)<=1,0,IF((('Fee Estimate Tool'!D$88-'Fee Estimate Tool'!D$84)*24)<=AF4,AF4,('Fee Estimate Tool'!D$88-'Fee Estimate Tool'!D$84)*24))","v":0},{"$f":"IF(AG13<=0,0,IF(('Fee Estimate Tool'!D$88-'Fee Estimate Tool'!D$86)*24+0.5<=$AG$4,$AG$4,('Fee Estimate Tool'!D$88-'Fee Estimate Tool'!D$86)*24+0.5))","v":0},{"$f":"IF(AH13<=0,0,IF(('Fee Estimate Tool'!D$87-'Fee Estimate Tool'!D$85)*24<=$AG$4,$AG$4,('Fee Estimate Tool'!D$87-'Fee Estimate Tool'!D$85)*24))","v":0},null,null,null,null,null,null,null,null,null,null,"10:00:00"]
["Charge",{"$f":"INDEX($B$3:$E$6,MATCH('Fee Estimate Tool'!$C$15,$A$3:$A$6,0),MATCH($B$1,$B$1:$E$1,0))*B14","v":{"$error":"#N/A"}},{"$f":"INDEX($B$3:$E$6,MATCH('Fee Estimate Tool'!$C$15,$A$3:$A$6,0),MATCH($C$1,$B$1:$E$1,0))*C14","v":{"$error":"#N/A"}},{"$f":"INDEX($B$3:$E$6,MATCH('Fee Estimate Tool'!$C$15,$A$3:$A$6,0),MATCH($D$1,$B$1:$E$1,0))*D14","v":{"$error":"#N/A"}},null,null,null,null,null,null,null,null,null,null,null,null,null,null,null,null,null,null,null,"Day 3",{"$f":"IFERROR(IF('Fee Estimate Tool'!E$82=\"\",0,IF('Fee Estimate Tool'!E$82<Info!$AX$3,(Info!$AX$3-'Fee Estimate Tool'!E$82)*24,0)),0)","v":0},{"$f":"IFERROR(IF('Fee Estimate Tool'!E$160=\"\",0,IF('Fee Estimate Tool'!E$160<Info!$AX$3,(Info!$AX$3-'Fee Estimate Tool'!E$160)*24,0)),0)","v":0},{"$f":"IFERROR(IF('Fee Estimate Tool'!E$70=\"\",0,IF('Fee Estimate Tool'!E$70<Info!$AX$3,(Info!$AX$3-'Fee Estimate Tool'!E$70)*24,0)),0)","v":0},null,"Day 3 - Staff #",{"$f":"IFERROR(SUM('Fee Estimate Tool'!E$103),0)","v":0},{"$f":"IFERROR('Fee Estimate Tool'!E$104-'Fee Estimate Tool'!E$103,0)","v":0},{"$f":"IF(AND('Fee Estimate Tool'!E$93=\"Yes\",AD15=1),1,0)","v":0},{"$f":"IF('Fee Estimate Tool'!E$93=\"Yes\",'Fee Estimate Tool'!E$110-'Fee Estimate Tool'!E$109,0)","v":0},{"$f":"IF('Fee Estimate Tool'!E$93=\"Yes\",'Fee Estimate Tool'!E$109,0)","v":0},null,null,null,null,null,null,null,null,null,null,"10:30:00"]
["Day 3 - Frequency",{"$f":"IF('Fee Estimate Tool'!E$94=$B$8,1,0)","v":0},{"$f":"IF('Fee Estimate Tool'!E$162=$B$8,1,0)","v":0},{"$f":"IF('Fee Estimate Tool'!E$72=$B$8,1,0)","v":0},null,null,null,null,null,null,null,null,null,null,null,null,null,null,null,null,null,null,null,"Charge",{"$f":"IFERROR(Y15*$Y$3,0)","v":0},{"$f":"IFERROR(Z15*$Y$3,0)","v":0},{"$f":"IFERROR(AA15*$Y$3,0)","v":0},null,"Hours",{"$f":"IF(COUNTA('Fee Estimate Tool'!E$82,'Fee Estimate Tool'!E$88)<=1,0,IF((('Fee Estimate Tool'!E$88-'Fee Estimate Tool'!E$82)*24)<=$AD$4,$AD$4,('Fee Estimate Tool'!E$88-'Fee Estimate Tool'!E$82)*24))","v":0},{"$f":"IF(COUNTA('Fee Estimate Tool'!E$82,'Fee Estimate Tool'!E$88)<=1,0,IF((('Fee Estimate Tool'!E$88-'Fee Estimate Tool'!E$82)*24)<=AE4,AE4,('Fee Estimate Tool'!E$88-'Fee Estimate Tool'!E$82)*24))","v":0},{"$f":"IF(COUNTA('Fee Estimate Tool'!E$85,'Fee Estimate Tool'!E$88)<=1,0,IF((('Fee Estimate Tool'!E$88-'Fee Estimate Tool'!E$84)*24)<=AF4,AF4,('Fee Estimate Tool'!E$88-'Fee Estimate Tool'!E$84)*24))","v":0},{"$f":"IF(AG15<=0,0,IF(('Fee Estimate Tool'!E$88-'Fee Estimate Tool'!E$86)*24+0.5<=$AG$4,$AG$4,('Fee Estimate Tool'!E$88-'Fee Estimate Tool'!E$86)*24+0.5))","v":0},{"$f":"IF(AH15<=0,0,IF(('Fee Estimate Tool'!E$87-'Fee Estimate Tool'!E$85)*24<=$AG$4,$AG$4,('Fee Estimate Tool'!E$87-'Fee Estimate Tool'!E$85)*24))","v":0},null,null,null,null,null,null,null,null,null,null,"11:00:00"]
["Charge",{"$f":"INDEX($B$3:$E$6,MATCH('Fee Estimate Tool'!$C$15,$A$3:$A$6,0),MATCH($B$1,$B$1:$E$1,0))*B16","v":{"$error":"#N/A"}},{"$f":"INDEX($B$3:$E$6,MATCH('Fee Estimate Tool'!$C$15,$A$3:$A$6,0),MATCH($C$1,$B$1:$E$1,0))*C16","v":{"$error":"#N/A"}},{"$f":"INDEX($B$3:$E$6,MATCH('Fee Estimate Tool'!$C$15,$A$3:$A$6,0),MATCH($D$1,$B$1:$E$1,0))*D16","v":{"$error":"#N/A"}},null,null,null,null,null,null,null,null,null,null,null,null,null,null,null,null,null,null,null,"Day 4",{"$f":"IFERROR(IF('Fee Estimate Tool'!F$82=\"\",0,IF('Fee Estimate Tool'!F$82<Info!$AX$3,(Info!$AX$3-'Fee Estimate Tool'!F$82)*24,0)),0)","v":0},{"$f":"IFERROR(IF('Fee Estimate Tool'!F$160=\"\",0,IF('Fee Estimate Tool'!F$160<Info!$AX$3,(Info!$AX$3-'Fee Estimate Tool'!F$160)*24,0)),0)","v":0},{"$f":"IFERROR(IF('Fee Estimate Tool'!F$70=\"\",0,IF('Fee Estimate Tool'!F$70<Info!$AX$3,(Info!$AX$3-'Fee Estimate Tool'!F$70)*24,0)),0)","v":0},null,"Day 4 - Staff #",{"$f":"IFERROR(SUM('Fee Estimate Tool'!F$103),0)","v":0},{"$f":"IFERROR('Fee Estimate Tool'!F$104-'Fee Estimate Tool'!F$103,0)","v":0},{"$f":"IF(AND('Fee Estimate Tool'!F$93=\"Yes\",AD17=1),1,0)","v":0},{"$f":"IF('Fee Estimate Tool'!F$93=\"Yes\",'Fee Estimate Tool'!F$110-'Fee Estimate Tool'!F$109,0)","v":0},{"$f":"IF('Fee Estimate Tool'!F$93=\"Yes\",'Fee Estimate Tool'!F$109,0)","v":0},null,null,null,null,null,null,null,null,null,null,"11:30:00"]
["Day 4 - Frequency",{"$f":"IF('Fee Estimate Tool'!F$94=$B$8,1,0)","v":0},{"$f":"IF('Fee Estimate Tool'!F$162=$B$8,1,0)","v":0},{"$f":"IF('Fee Estimate Tool'!F$72=$B$8,1,0)","v":0},null,null,null,null,null,null,null,null,null,null,null,null,null,null,null,null,null,null,null,"Charge",{"$f":"IFERROR(Y17*$Y$3,0)","v":0},{"$f":"IFERROR(Z17*$Y$3,0)","v":0},{"$f":"IFERROR(AA17*$Y$3,0)","v":0},null,"Hours",{"$f":"IF(COUNTA('Fee Estimate Tool'!F$82,'Fee Estimate Tool'!F$88)<=1,0,IF((('Fee Estimate Tool'!F$88-'Fee Estimate Tool'!F$82)*24)<=$AD$4,$AD$4,('Fee Estimate Tool'!F$88-'Fee Estimate Tool'!F$82)*24))","v":0},{"$f":"IF(COUNTA('Fee Estimate Tool'!F$82,'Fee Estimate Tool'!F$88)<=1,0,IF((('Fee Estimate Tool'!F$88-'Fee Estimate Tool'!F$82)*24)<=AE4,AE4,('Fee Estimate Tool'!F$88-'Fee Estimate Tool'!F$82)*24))","v":0},{"$f":"IF(COUNTA('Fee Estimate Tool'!F$85,'Fee Estimate Tool'!F$88)<=1,0,IF((('Fee Estimate Tool'!F$88-'Fee Estimate Tool'!F$84)*24)<=AF4,AF4,('Fee Estimate Tool'!F$88-'Fee Estimate Tool'!F$84)*24))","v":0},{"$f":"IF(AG17<=0,0,IF(('Fee Estimate Tool'!F$88-'Fee Estimate Tool'!F$86)*24+0.5<=$AG$4,$AG$4,('Fee Estimate Tool'!F$88-'Fee Estimate Tool'!F$86)*24+0.5))","v":0},{"$f":"IF(AH17<=0,0,IF(('Fee Estimate Tool'!F$87-'Fee Estimate Tool'!F$85)*24<=$AG$4,$AG$4,('Fee Estimate Tool'!F$87-'Fee Estimate Tool'!F$85)*24))","v":0},null,null,null,null,null,null,null,null,null,null,"12:00:00"]
["Charge",{"$f":"INDEX($B$3:$E$6,MATCH('Fee Estimate Tool'!$C$15,$A$3:$A$6,0),MATCH($B$1,$B$1:$E$1,0))*B18","v":{"$error":"#N/A"}},{"$f":"INDEX($B$3:$E$6,MATCH('Fee Estimate Tool'!$C$15,$A$3:$A$6,0),MATCH($C$1,$B$1:$E$1,0))*C18","v":{"$error":"#N/A"}},{"$f":"INDEX($B$3:$E$6,MATCH('Fee Estimate Tool'!$C$15,$A$3:$A$6,0),MATCH($D$1,$B$1:$E$1,0))*D18","v":{"$error":"#N/A"}},null,null,null,null,null,null,null,null,null,null,null,null,null,null,null,null,null,null,null,"Day 5",{"$f":"IFERROR(IF('Fee Estimate Tool'!G$82=\"\",0,IF('Fee Estimate Tool'!G$82<Info!$AX$3,(Info!$AX$3-'Fee Estimate Tool'!G$82)*24,0)),0)","v":0},{"$f":"IFERROR(IF('Fee Estimate Tool'!G$160=\"\",0,IF('Fee Estimate Tool'!G$160<Info!$AX$3,(Info!$AX$3-'Fee Estimate Tool'!G$160)*24,0)),0)","v":0},{"$f":"IFERROR(IF('Fee Estimate Tool'!G$70=\"\",0,IF('Fee Estimate Tool'!G$70<Info!$AX$3,(Info!$AX$3-'Fee Estimate Tool'!G$70)*24,0)),0)","v":0},null,"Day 5 - Staff #",{"$f":"IFERROR(SUM('Fee Estimate Tool'!G$103),0)","v":0},{"$f":"IFERROR('Fee Estimate Tool'!G$104-'Fee Estimate Tool'!G$103,0)","v":0},{"$f":"IF(AND('Fee Estimate Tool'!G$93=\"Yes\",AD19=1),1,0)","v":0},{"$f":"IF('Fee Estimate Tool'!G$93=\"Yes\",'Fee Estimate Tool'!G$110-'Fee Estimate Tool'!G$109,0)","v":0},{"$f":"IF('Fee Estimate Tool'!G$93=\"Yes\",'Fee Estimate Tool'!G$109,0)","v":0},null,null,null,null,null,null,null,null,null,null,"12:30:00"]
["Day 5 - Frequency",{"$f":"IF('Fee Estimate Tool'!G$94=$B$8,1,0)","v":0},{"$f":"IF('Fee Estimate Tool'!G$162=$B$8,1,0)","v":0},{"$f":"IF('Fee Estimate Tool'!G$72=$B$8,1,0)","v":0},null,null,null,null,null,null,null,null,null,null,null,null,null,null,null,null,null,null,null,"Charge",{"$f":"IFERROR(Y19*$Y$3,0)","v":0},{"$f":"IFERROR(Z19*$Y$3,0)","v":0},{"$f":"IFERROR(AA19*$Y$3,0)","v":0},null,"Hours",{"$f":"IF(COUNTA('Fee Estimate Tool'!G$82,'Fee Estimate Tool'!G$88)<=1,0,IF((('Fee Estimate Tool'!G$88-'Fee Estimate Tool'!G$82)*24)<=$AD$4,$AD$4,('Fee Estimate Tool'!G$88-'Fee Estimate Tool'!G$82)*24))","v":0},{"$f":"IF(COUNTA('Fee Estimate Tool'!G$82,'Fee Estimate Tool'!G$88)<=1,0,IF((('Fee Estimate Tool'!G$88-'Fee Estimate Tool'!G$82)*24)<=AE4,AE4,('Fee Estimate Tool'!G$88-'Fee Estimate Tool'!G$82)*24))","v":0},{"$f":"IF(COUNTA('Fee Estimate Tool'!G$85,'Fee Estimate Tool'!G$88)<=1,0,IF((('Fee Estimate Tool'!G$88-'Fee Estimate Tool'!G$84)*24)<=AF4,AF4,('Fee Estimate Tool'!G$88-'Fee Estimate Tool'!G$84)*24))","v":0},{"$f":"IF(AG19<=0,0,IF(('Fee Estimate Tool'!G$88-'Fee Estimate Tool'!G$86)*24+0.5<=$AG$4,$AG$4,('Fee Estimate Tool'!G$88-'Fee Estimate Tool'!G$86)*24+0.5))","v":0},{"$f":"IF(AH19<=0,0,IF(('Fee Estimate Tool'!G$87-'Fee Estimate Tool'!G$85)*24<=$AG$4,$AG$4,('Fee Estimate Tool'!G$87-'Fee Estimate Tool'!G$85)*24))","v":0},null,null,null,null,null,null,null,null,null,null,"13:00:00"]
{"$rows_left_out":101}
{"sheet":"Fees","index":2,"n_rows":66,"n_cols":8,"rows_kept":66,"cut":false,"hidden":true,"merged":[]}
["IMPORTANT NOTES",null,null,null,null,null,null,"HIDE COLUMNS BY CLICKING HEADER ABOVE \"H\""]
["example","Fields in Grey are to be edited without breaking the formulas that auto-calculated the fees",null,null,null,null,null,"THEN HOLD THE SHIFT KEY and click header \"A\""]
["example","Dark blue cells are to be edited here and will copy over to the Fee Estimate Tool Sheet",null,null,null,null,null,"THEN RIGHT CLICK \"A\""]
["example","Black cells are not to be touched",null,null,null,null,null,"SELECT \"HIDE\""]
[]
["Rates in effect January 2019 - December 2019"]
[null,"Registered Not-for-Profit / Community Group","Private","Affiliate","Commercial"]
["Theatre Auditorium",314,418,235,627]
["Rehearsal Hall",122,155,99,200]
["Lobby",320,400,183,520]
["Green Room",0,0,0,0]
["Additional Fees"]
["Daily"]
["Fog Machine",25,25,15,25]
["Hazer",25,25,15,25]
["Wireless Microphones",35,35,17.5,35]
["Intelligent Lighting Package",300,300,300,300]
["Wireless Communication Pack",35,35,17.5,35]
["Weekly"]
[{"$f":"A14","v":"Fog Machine"},75,75,60,75]
{"$rows_left_out":46}